Target
Adenylate cyclase type 10
Ligand
BDBM50607664
Substrate
Meas. Tech.
ChEMBL_2263077 (CHEMBL5218088)
IC50
389±n/a nM
Citation
 Miller, MRossetti, TFerreira, JGhanem, LBalbach, MKaur, NLevin, LRBuck, JKehr, MCoquille, Svan den Heuvel, JSteegborn, CFushimi, MFinkin-Groner, EMyers, RWKargman, SLiverton, NJHuggins, DJMeinke, PT Design, Synthesis, and Pharmacological Evaluation of Second-Generation Soluble Adenylyl Cyclase (sAC, ADCY10) Inhibitors with Slow Dissociation Rates. J Med Chem 65:15208-15226 (2022) Target
Name:
Adenylate cyclase type 10
Synonyms:
ADCY10 AH-related protein Germ cell soluble adenylyl cyclase Testicular soluble adenylyl cyclase | hsAC
Type:
PROTEIN
Mol. Mass.:
187169.28
Organism:
Homo sapiens (Human)
Description:
ChEMBL_514281
Residue:
1610
  
Inhibitor
Name:
BDBM50607664
Synonyms:
CHEMBL5219159
Type:
Small organic molecule
Emp. Form.:
C15H13Cl2N5
Mol. Mass.:
334.203
SMILES:
Cn1cc(Cc2cccc(Cl)c2)c(n1)-c1cc(Cl)nc(N)n1
: