Target
Adenylate cyclase type 10
Ligand
BDBM50607685
Substrate
Meas. Tech.
ChEMBL_2263079 (CHEMBL5218090)
IC50
11±n/a nM
Citation
 Miller, MRossetti, TFerreira, JGhanem, LBalbach, MKaur, NLevin, LRBuck, JKehr, MCoquille, Svan den Heuvel, JSteegborn, CFushimi, MFinkin-Groner, EMyers, RWKargman, SLiverton, NJHuggins, DJMeinke, PT Design, Synthesis, and Pharmacological Evaluation of Second-Generation Soluble Adenylyl Cyclase (sAC, ADCY10) Inhibitors with Slow Dissociation Rates. J Med Chem 65:15208-15226 (2022) Target
Name:
Adenylate cyclase type 10
Synonyms:
4.6.1.1 Adcy10 Sac | Testicular soluble adenylyl cyclase
Type:
PROTEIN
Mol. Mass.:
185863.75
Organism:
Rattus norvegicus
Description:
ChEMBL_120747
Residue:
1608
  
Inhibitor
Name:
BDBM50607685
Synonyms:
CHEMBL5220647
Type:
Small organic molecule
Emp. Form.:
C22H25ClF2N6O3
Mol. Mass.:
494.922
SMILES:
Nc1nc(Cl)cc(n1)-c1nn(cc1Cc1ccccc1OCCN1CCOC[C@@H]1CO)C(F)F
: