Target
Dipeptidyl peptidase 8
Ligand
BDBM50191166
Substrate
Meas. Tech.
ChEMBL_397958 (CHEMBL856335)
IC50
65000±n/a nM
Citation
 Soroka, AVan der Veken, PDe Meester, ILambeir, AMMaes, MBScharpé, SHaemers, AAugustyns, K Synthesis and dipeptidyl peptidase inhibition of N-(4-substituted-2,4-diaminobutanoyl)piperidines. Bioorg Med Chem Lett 16:4777-9 (2006)  
Target
Name:
Dipeptidyl peptidase 8
Synonyms:
DPP8 DPRP-1 Dipeptidyl peptidase 8 (DPP-8) Dipeptidyl peptidase 8/9 Dipeptidyl peptidase VIII Prolyl dipeptidase DPP8
Type:
Enzyme
Mol. Mass.:
103342.62
Organism:
Homo sapiens (Human)
Description:
Q6V1X1
Residue:
898
  
Inhibitor
Name:
BDBM50191166
Synonyms:
(2S,4R)-4-(4-chlorobenzylamino)-2-amino-1-(piperidin-1-yl)pentan-1-one | CHEMBL215824
Type:
Small organic molecule
Emp. Form.:
C17H26ClN3O
Mol. Mass.:
323.861
SMILES:
C[C@H](C[C@H](N)C(=O)N1CCCCC1)NCc1ccc(Cl)cc1
: