Target
Beta-lactamase
Ligand
BDBM50191378
Substrate
Meas. Tech.
ChEMBL_365445 (CHEMBL869112)
IC50
5±n/a nM
Citation
 Venkatesan, AMAgarwal, AAbe, TUshirogochi, HYamamura, IAdo, MTsuyoshi, TDos Santos, OGu, YSum, FWLi, ZFrancisco, GLin, YIPetersen, PJYang, YKumagai, TWeiss, WJShlaes, DMKnox, JRMansour, TS Structure-activity relationship of 6-methylidene penems bearing 6,5 bicyclic heterocycles as broad-spectrum beta-lactamase inhibitors: evidence for 1,4-thiazepine intermediates with C7 R stereochemistry by computational methods. J Med Chem 49:4623-37 (2006)  
Target
Name:
Beta-lactamase
Synonyms:
AMPC_ENTCL | ampC
Type:
PROTEIN
Mol. Mass.:
41306.67
Organism:
Enterobacter cloacae
Description:
ChEMBL_40258
Residue:
381
  
Inhibitor
Name:
BDBM50191378
Synonyms:
CHEMBL212163 | sodium (R,E)-6-((6,8-dihydro-5H-imidazo[2,1-c][1,4]oxazin-2-yl)methylene)-7-oxo-4-thia-1-aza-bicyclo[3.2.0]hept-2-ene-2-carboxylate
Type:
Small organic molecule
Emp. Form.:
C13H10N3O4S
Mol. Mass.:
304.302
SMILES:
[O-]C(=O)C1=CS[C@H]2N1C(=O)\C2=C/c1cn2CCOCc2n1
: