Target
Histamine H4 receptor
Ligand
BDBM50194213
Substrate
Meas. Tech.
ChEMBL_393875 (CHEMBL912691)
Ki
>1000±n/a nM
Citation
 Watanabe, MKazuta, YHayashi, HYamada, SMatsuda, AShuto, S Stereochemical diversity-oriented conformational restriction strategy. Development of potent histamine H3 and/or H4 receptor antagonists with an imidazolylcyclopropane structure. J Med Chem 49:5587-96 (2006)  
Target
Name:
Histamine H4 receptor
Synonyms:
AXOR35 GPCR105 HH4R HRH4 Histamine H4 receptor Histamine receptor (H3 and H4) SP9144
Type:
G Protein-Coupled Receptor (GPCR)
Mol. Mass.:
44517.02
Organism:
Homo sapiens (Human)
Description:
Binding assays were using CHO cells stably expressing hH4R receptors.
Residue:
390
  
Inhibitor
Name:
BDBM50194213
Synonyms:
(1R,2R)-cis-2-[2-(cyclohexylmethylamino)ethyl]-1-(1H-imidazol-4-yl)cyclopropane | CHEMBL213413
Type:
Small organic molecule
Emp. Form.:
C15H25N3
Mol. Mass.:
247.3791
SMILES:
C(C[C@H]1C[C@H]1c1cnc[nH]1)NCC1CCCCC1
: