Target
Muscarinic acetylcholine receptor M2
Ligand
BDBM50194655
Substrate
Meas. Tech.
ChEMBL_395700 (CHEMBL909208)
Ki
110±n/a nM
Citation
 Sagara, YSagara, TUchiyama, MOtsuki, SKimura, TFujikawa, TNoguchi, KOhtake, N Identification of a novel 4-aminomethylpiperidine class of M3 muscarinic receptor antagonists and structural insight into their M3 selectivity. J Med Chem 49:5653-63 (2006)  
Target
Name:
Muscarinic acetylcholine receptor M2
Synonyms:
ACM2_HUMAN Cholinergic, muscarinic M2 Muscarinic acetylcholine receptor M2 and M5 | RecName: Full=Muscarinic acetylcholine receptor M2
Type:
GPCR
Mol. Mass.:
51730.61
Organism:
Homo sapiens (Human)
Description:
P08172
Residue:
466
  
Inhibitor
Name:
BDBM50194655
Synonyms:
(2R)-N-(1-cyclopentyl-4-piperidinylmethyl)-1-((2S,4R)-4-hydroxy-1-[3,3,3-tris(4-fluorophenyl)-propanoyl]pyrrolidine-2-yl)carbonylpyrrolidine-2-carboxamide | CHEMBL212645
Type:
Small organic molecule
Emp. Form.:
C42H49F3N4O4
Mol. Mass.:
730.8581
SMILES:
O[C@@H]1C[C@H](N(C1)C(=O)CC(c1ccc(F)cc1)(c1ccc(F)cc1)c1ccc(F)cc1)C(=O)N1CCC[C@@H]1C(=O)NCC1CCN(CC1)C1CCCC1
: