Target
Muscarinic acetylcholine receptor M5
Ligand
BDBM50194647
Substrate
Meas. Tech.
ChEMBL_395702 (CHEMBL909210)
Ki
>5100±n/a nM
Citation
 Sagara, YSagara, TUchiyama, MOtsuki, SKimura, TFujikawa, TNoguchi, KOhtake, N Identification of a novel 4-aminomethylpiperidine class of M3 muscarinic receptor antagonists and structural insight into their M3 selectivity. J Med Chem 49:5653-63 (2006)  
Target
Name:
Muscarinic acetylcholine receptor M5
Synonyms:
ACM5_HUMAN | CHRM5
Type:
PROTEIN
Mol. Mass.:
60102.35
Organism:
Homo sapiens (Human)
Description:
ChEMBL_1517990
Residue:
532
  
Inhibitor
Name:
BDBM50194647
Synonyms:
(2R)-1-[(2S,4R)-4-hydroxy-1-(3,3,3-triphenylpropanoyl)pyrrolidine-2-yl]carbonyl-N-(4-piperidinylethyl)pyrrolidine-2-carboxamide | CHEMBL211976
Type:
Small organic molecule
Emp. Form.:
C38H46N4O4
Mol. Mass.:
622.7962
SMILES:
O[C@@H]1C[C@H](N(C1)C(=O)CC(c1ccccc1)(c1ccccc1)c1ccccc1)C(=O)N1CCC[C@@H]1C(=O)NCCC1CCNCC1
: