Target
Adenosine receptor A1
Ligand
BDBM50194818
Substrate
Meas. Tech.
ChEMBL_424567 (CHEMBL913647)
Ki
840±n/a nM
Citation
 Richardson, CMGillespie, RJWilliamson, DSJordan, AMFink, AKnight, ARSellwood, DMMisra, A Identification of non-furan containing A2A antagonists using database mining and molecular similarity approaches. Bioorg Med Chem Lett 16:5993-7 (2006)  
Target
Name:
Adenosine receptor A1
Synonyms:
A1 adenosine receptor (hA1) AA1R_HUMAN ADORA1 Adenosine A1-receptor Adenosine receptor A1 (hA1) | Adenosine transporter (AdT)
Type:
G Protein-Coupled Receptor (GPCR)
Mol. Mass.:
36520.92
Organism:
Homo sapiens (Human)
Description:
P30542
Residue:
326
  
Inhibitor
Name:
BDBM50194818
Synonyms:
4-(3-(6-methoxypyridin-3-yl)phenyl)-6-(methylthio)-1,3,5-triazin-2-amine | CHEMBL426530
Type:
Small organic molecule
Emp. Form.:
C16H15N5OS
Mol. Mass.:
325.388
SMILES:
COc1ccc(cn1)-c1cccc(c1)-c1nc(N)nc(SC)n1
: