Target
Peroxisome proliferator-activated receptor alpha
Ligand
BDBM50194974
Substrate
Meas. Tech.
ChEMBL_424617 (CHEMBL855679)
EC50
23±n/a nM
Citation
 Humphries, PSBailey, SAlmaden, JVBarnum, SJCarlson, TJChristie, LCDo, QQFraser, JDHess, MKellum, JKim, YHMcClellan, GAOgilvie, KMSimmons, BHSkalitzky, DSun, SWilhite, DZehnder, LR Pyridine-3-propanoic acids: Discovery of dual PPARalpha/gamma agonists as antidiabetic agents. Bioorg Med Chem Lett 16:6120-3 (2006)  
Target
Name:
Peroxisome proliferator-activated receptor alpha
Synonyms:
NR1C1 PPAR PPAR-alpha PPARA_HUMAN Peroxisome proliferator-activated receptor | Peroxisome proliferator-activated receptor alpha (PPAR alpha)
Type:
Enzyme
Mol. Mass.:
52222.08
Organism:
Homo sapiens (Human)
Description:
Q07869
Residue:
468
  
Inhibitor
Name:
BDBM50194974
Synonyms:
2-((6-(2-(5-methyl-2-p-tolyloxazol-4-yl)ethoxy)pyridin-3-yl)methyl)-tetrahydrofuran-2-carboxylic acid | CHEMBL221184
Type:
Small organic molecule
Emp. Form.:
C24H26N2O5
Mol. Mass.:
422.4736
SMILES:
Cc1oc(nc1CCOc1ccc(CC2(CCCO2)C(O)=O)cn1)-c1ccc(C)cc1
: