Target
Mitogen-activated protein kinase kinase kinase 8
Ligand
BDBM50194998
Substrate
Meas. Tech.
ChEMBL_424645 (CHEMBL855706)
IC50
3±n/a nM
Citation
 Hu, YGreen, NGavrin, LKJanz, KKaila, NLi, HQThomason, JRCuozzo, JWHall, JPHsu, SNickerson-Nutter, CTelliez, JBLin, LLTam, S Inhibition of Tpl2 kinase and TNFalpha production with quinoline-3-carbonitriles for the treatment of rheumatoid arthritis. Bioorg Med Chem Lett 16:6067-72 (2006)  
Target
Name:
Mitogen-activated protein kinase kinase kinase 8
Synonyms:
C-COT COT proto-oncogene serine/threonine-protein kinase ESTF MAP3K8 Tumor Progression Loci-2 Kinase (COT) | Tumor progression locus 2
Type:
Serine/threonine-protein kinase
Mol. Mass.:
52916.89
Organism:
Homo sapiens (Human)
Description:
P41279
Residue:
467
  
Inhibitor
Name:
BDBM50194998
Synonyms:
4-(3-chloro-4-fluorophenylamino)-6-((5-methyl-1H-imidazol-4-yl)methylamino)quinoline-3-carbonitrile | CHEMBL221221
Type:
Small organic molecule
Emp. Form.:
C21H16ClFN6
Mol. Mass.:
406.843
SMILES:
Cc1nc[nH]c1CNc1ccc2ncc(C#N)c(Nc3ccc(F)c(Cl)c3)c2c1
: