Target
Thyrotropin-releasing hormone receptor
Ligand
BDBM50196456
Substrate
Meas. Tech.
ChEMBL_431932 (CHEMBL917827)
Ki
>100000±n/a nM
Citation
 Kaur, NMonga, VLu, XGershengorn, MCJain, R Modifications of the pyroglutamic acid and histidine residues in thyrotropin-releasing hormone (TRH) yield analogs with selectivity for TRH receptor type 2 over type 1. Bioorg Med Chem 15:433-43 (2006)  
Target
Name:
Thyrotropin-releasing hormone receptor
Synonyms:
Thyrotropin-releasing hormone receptor 2
Type:
PROTEIN
Mol. Mass.:
39044.21
Organism:
Rattus norvegicus
Description:
ChEMBL_532304
Residue:
352
  
Inhibitor
Name:
BDBM50196456
Synonyms:
(2S)-1-[(2S)-2-(2S)-6-oxohexahydro-2-pyridinylcarboxamido]-3-(2-isopropyl-1H-imidazolyl)propanoyl]-azalone-2-carboxamide | CHEMBL388812
Type:
Small organic molecule
Emp. Form.:
C20H30N6O4
Mol. Mass.:
418.49
SMILES:
CC(C)c1ncc(C[C@H](NC(=O)[C@@H]2CCCC(=O)N2)C(=O)N2CCC[C@H]2C(N)=O)[nH]1
: