Target
Bifunctional epoxide hydrolase 2
Ligand
BDBM25737
Substrate
Meas. Tech.
ChEMBL_432025 (CHEMBL918224)
IC50
100±n/a nM
Citation
 Kim, IHNishi, KTsai, HJBradford, TKoda, YWatanabe, TMorisseau, CBlanchfield, JToth, IHammock, BD Design of bioavailable derivatives of 12-(3-adamantan-1-yl-ureido)dodecanoic acid, a potent inhibitor of the soluble epoxide hydrolase. Bioorg Med Chem 15:312-23 (2006)  
Target
Name:
Bifunctional epoxide hydrolase 2
Synonyms:
Cytosolic epoxide hydrolase 2 EPHX2 HYES_HUMAN Soluble epoxide hydrolase (sEH) | epoxide hydrolase 2, cytoplasmic
Type:
Enzyme
Mol. Mass.:
62613.07
Organism:
Homo sapiens (Human)
Description:
P34913
Residue:
555
  
Inhibitor
Name:
BDBM25737
Synonyms:
12-[(adamantan-1-ylcarbamoyl)amino]dodecanoic acid US10383835, Compound 700 | Urea-based compound, 18
Type:
Small organic molecule
Emp. Form.:
C23H40N2O3
Mol. Mass.:
392.5753
SMILES:
OC(=O)CCCCCCCCCCCNC(=O)NC12CC3CC(CC(C3)C1)C2
: