Target
Neuropeptide Y receptor type 5
Ligand
BDBM50197009
Substrate
Meas. Tech.
ChEMBL_453179 (CHEMBL902329)
Ki
>1000±n/a nM
Citation
 DeCarr, LBBuckholz, TMCoish, PDFathi, ZFisk, SEMays, MRO'Connor, SJLumb, KJ Identification of selective neuropeptide Y2 peptide agonists. Bioorg Med Chem Lett 17:538-41 (2007)  
Target
Name:
Neuropeptide Y receptor type 5
Synonyms:
NPY-Y5 NPY5-R NPY5R_HUMAN NPYY5 Neuropeptide Y receptor type 5 ( NPY Y5) | Y5 receptor
Type:
Enzyme
Mol. Mass.:
50746.64
Organism:
Homo sapiens (Human)
Description:
Q15761
Residue:
445
  
Inhibitor
Name:
BDBM50197009
Synonyms:
(2S)-2-[(2S)-2-[(2S,3R)-2-[(2S)-2-[(2S)-2-[(2S)-2-[(2S)-2-[(2S)-2-[(2S)-2-[(2S)-2-[(4-amino-2-chlorophenyl)formamido]-5-carbamimidamidopentanamido]-3-(1H-imidazol-5-yl)propanamido]-3-(4-hydroxyphenyl)propanamido]-4-methylpentanamido]-3-carbamoylpropanamido]-4-methylpentanamido]-3-methylbutanamido]-3-hydroxybutanamido]-5-carbamimidamidopentanamido]-N-[(1S)-4-carbamimidamido-1-{[(1S)-1-carbamoyl-2-(4-hydroxyphenyl)ethyl]carbamoyl}butyl]pentanediamide | CHEMBL436630
Type:
Small organic molecule
Emp. Form.:
C79H120ClN27O18
Mol. Mass.:
1771.421
SMILES:
CC(C)C[C@H](NC(=O)[C@H](Cc1ccc(O)cc1)NC(=O)[C@H](Cc1cnc[nH]1)NC(=O)[C@H](CCCN=C(N)N)NC(=O)c1ccc(N)cc1Cl)C(=O)N[C@@H](CC(N)=O)C(=O)N[C@@H](CC(C)C)C(=O)N[C@@H](C(C)C)C(=O)N[C@@H]([C@@H](C)O)C(=O)N[C@@H](CCCN=C(N)N)C(=O)N[C@@H](CCC(N)=O)C(=O)N[C@@H](CCCN=C(N)N)C(=O)N[C@@H](Cc1ccc(O)cc1)C(N)=O
: