Target
Neuropeptide Y receptor type 2
Ligand
BDBM50197023
Substrate
Meas. Tech.
ChEMBL_453177 (CHEMBL902327)
Ki
5±n/a nM
Citation
 DeCarr, LBBuckholz, TMCoish, PDFathi, ZFisk, SEMays, MRO'Connor, SJLumb, KJ Identification of selective neuropeptide Y2 peptide agonists. Bioorg Med Chem Lett 17:538-41 (2007)  
Target
Name:
Neuropeptide Y receptor type 2
Synonyms:
NPY-Y2 NPY2-R NPY2R_HUMAN Y2 receptor | neuropeptide Y receptor Y2
Type:
Enzyme Catalytic Domain
Mol. Mass.:
42734.65
Organism:
Homo sapiens (Human)
Description:
NPY-Y2 NPY2R HUMAN::P49146
Residue:
381
  
Inhibitor
Name:
BDBM50197023
Synonyms:
(2S)-2-[(2S)-2-[(2S,3R)-2-[(2S)-2-[(2S)-2-[(2S)-2-[(2S)-2-[(2S)-2-[(2S)-2-[(2S)-2-[(4-amino-3-methoxyphenyl)formamido]-5-carbamimidamidopentanamido]-3-(1H-imidazol-5-yl)propanamido]-3-(4-hydroxyphenyl)propanamido]-4-methylpentanamido]-3-carbamoylpropanamido]-4-methylpentanamido]-3-methylbutanamido]-3-hydroxybutanamido]-5-carbamimidamidopentanamido]-N-[(1S)-4-carbamimidamido-1-{[(1S)-1-carbamoyl-2-(4-hydroxyphenyl)ethyl]carbamoyl}butyl]pentanediamide | CHEMBL411765
Type:
Small organic molecule
Emp. Form.:
C80H123N27O19
Mol. Mass.:
1767.0021
SMILES:
COc1cc(ccc1N)C(=O)N[C@@H](CCCN=C(N)N)C(=O)N[C@@H](Cc1cnc[nH]1)C(=O)N[C@@H](Cc1ccc(O)cc1)C(=O)N[C@@H](CC(C)C)C(=O)N[C@@H](CC(N)=O)C(=O)N[C@@H](CC(C)C)C(=O)N[C@@H](C(C)C)C(=O)N[C@@H]([C@@H](C)O)C(=O)N[C@@H](CCCN=C(N)N)C(=O)N[C@@H](CCC(N)=O)C(=O)N[C@@H](CCCN=C(N)N)C(=O)N[C@@H](Cc1ccc(O)cc1)C(N)=O
: