Target
Collagenase 3
Ligand
BDBM50197236
Substrate
Meas. Tech.
ChEMBL_440764 (CHEMBL889861)
IC50
195±n/a nM
Citation
 Condon, JSJoseph-McCarthy, DLevin, JILombart, HGLovering, FESun, LWang, WXu, WZhang, Y Identification of potent and selective TACE inhibitors via the S1 pocket. Bioorg Med Chem Lett 17:34-9 (2006)  
Target
Name:
Collagenase 3
Synonyms:
MMP-13 MMP13_HUMAN Matrix metalloproteinase-13 (MMP-13) | Matrix metalloproteinase-13 (MMP13)
Type:
Enzyme
Mol. Mass.:
53808.06
Organism:
Homo sapiens (Human)
Description:
P45452
Residue:
471
  
Inhibitor
Name:
BDBM50197236
Synonyms:
4-((4-(but-2-ynyloxy)phenylsulfonyl)methyl)-N-hydroxy-1-(morpholinosulfonyl)piperidine-4-carboxamide | CHEMBL231666
Type:
Small organic molecule
Emp. Form.:
C21H29N3O8S2
Mol. Mass.:
515.6
SMILES:
CC#CCOc1ccc(cc1)S(=O)(=O)CC1(CCN(CC1)S(=O)(=O)N1CCOCC1)C(=O)NO
: