Target
Sigma non-opioid intracellular receptor 1
Ligand
BDBM50198062
Substrate
Meas. Tech.
ChEMBL_432539 (CHEMBL918833)
Ki
5.8±n/a nM
Citation
 Collina, SLoddo, GUrbano, MLinati, LCallegari, AOrtuso, FAlcaro, SLaggner, CLanger, TPrezzavento, ORonsisvalle, GAzzolina, O Design, synthesis, and SAR analysis of novel selective sigma1 ligands. Bioorg Med Chem 15:771-83 (2006)  
Target
Name:
Sigma non-opioid intracellular receptor 1
Synonyms:
OPRS1 SIGMAR1 Sigma non-opioid intracellular receptor 1 Sigma1-receptor Sterol isomerase-like protein
Type:
Protein
Mol. Mass.:
25307.17
Organism:
Cavia porcellus (Guinea pig)
Description:
Q60492
Residue:
223
  
Inhibitor
Name:
BDBM50198062
Synonyms:
(R/S)-N-Benzyl-3-(biphenyl-4-yl)-N-methylbutan-1-amine benzyl-(3-biphenyl-4-yl-butyl)-methyl-amine
Type:
Small organic molecule
Emp. Form.:
C24H27N
Mol. Mass.:
329.4779
SMILES:
CC(CCN(C)Cc1ccccc1)c1ccc(cc1)-c1ccccc1
: