Target
Sigma non-opioid intracellular receptor 1
Ligand
BDBM50198068
Substrate
Meas. Tech.
ChEMBL_432539 (CHEMBL918833)
Ki
19.8±n/a nM
Citation
 Collina, SLoddo, GUrbano, MLinati, LCallegari, AOrtuso, FAlcaro, SLaggner, CLanger, TPrezzavento, ORonsisvalle, GAzzolina, O Design, synthesis, and SAR analysis of novel selective sigma1 ligands. Bioorg Med Chem 15:771-83 (2006)  
Target
Name:
Sigma non-opioid intracellular receptor 1
Synonyms:
OPRS1 SIGMAR1 Sigma non-opioid intracellular receptor 1 Sigma1-receptor Sterol isomerase-like protein
Type:
Protein
Mol. Mass.:
25307.17
Organism:
Cavia porcellus (Guinea pig)
Description:
Q60492
Residue:
223
  
Inhibitor
Name:
BDBM50198068
Synonyms:
(E)-N,N-dimethyl-3-(naphthalen-2-yl)but-2-en-1-amine CHEMBL224085
Type:
Small organic molecule
Emp. Form.:
C16H19N
Mol. Mass.:
225.3288
SMILES:
CN(C)C\C=C(/C)c1ccc2ccccc2c1
: