Target
Potassium voltage-gated channel subfamily A member 5
Ligand
BDBM50198247
Substrate
Meas. Tech.
ChEMBL_422114 (CHEMBL908799)
IC50
69±n/a nM
Citation
 Jackson, CMBlass, BCoburn, KDjandjighian, LFadayel, GFluxe, AJHodson, SJJanusz, JMMurawsky, MRidgeway, JMWhite, REWu, S Evolution of thiazolidine-based blockers of human Kv1.5 for the treatment of atrial arrhythmias. Bioorg Med Chem Lett 17:282-4 (2006)  
Target
Name:
Potassium voltage-gated channel subfamily A member 5
Synonyms:
HK2 KCNA5 Potassium voltage-gated channel subfamily A member 5 Voltage-gated potassium channel subunit Kv1.5
Type:
Enzyme
Mol. Mass.:
67222.47
Organism:
Homo sapiens (Human)
Description:
P22460
Residue:
613
  
Inhibitor
Name:
BDBM50198247
Synonyms:
2-(3,4-dimethylphenyl)-3-(4-methoxyphenethyl)-2-methylthiazolidin-4-one | CHEMBL384197
Type:
Small organic molecule
Emp. Form.:
C21H25NO2S
Mol. Mass.:
355.494
SMILES:
COc1ccc(CCN2C(=O)CSC2(C)c2ccc(C)c(C)c2)cc1
: