Target
Cannabinoid receptor 1
Ligand
BDBM50198517
Substrate
Meas. Tech.
ChEMBL_437693 (CHEMBL905968)
Ki
10±n/a nM
Citation
 Smith, RAFathi, ZBrown, SEChoi, SFan, JJenkins, SKluender, HCKonkar, ALavoie, RMays, RNatoli, JO'Connor, SJOrtiz, AAPodlogar, BTaing, CTomlinson, STritto, TZhang, Z Constrained analogs of CB-1 antagonists: 1,5,6,7-Tetrahydro-4H-pyrrolo[3,2-c]pyridine-4-one derivatives. Bioorg Med Chem Lett 17:673-8 (2007)  
Target
Name:
Cannabinoid receptor 1
Synonyms:
CANN6 CB-R CNR CNR1_HUMAN Cannabinoid receptor Cannabinoid receptor 1 (brain)
Type:
G Protein-Coupled Receptor (GPCR)
Mol. Mass.:
52868.96
Organism:
Homo sapiens (Human)
Description:
P21554
Residue:
472
  
Inhibitor
Name:
BDBM50198517
Synonyms:
5-cyclohexyl-1-(2,4-dichlorophenyl)-3-methyl-2-p-tolyl-6,7-dihydro-1H-pyrrolo[3,2-c]pyridin-4(5H)-one | CHEMBL230466
Type:
Small organic molecule
Emp. Form.:
C27H28Cl2N2O
Mol. Mass.:
467.43
SMILES:
Cc1c2c(CCN(C3CCCCC3)C2=O)n(c1-c1ccc(C)cc1)-c1ccc(Cl)cc1Cl
: