Target
Sphingosine 1-phosphate receptor 1
Ligand
BDBM50198830
Substrate
Meas. Tech.
ChEMBL_432835 (CHEMBL914103)
EC50
3.6±n/a nM
Citation
 Foss, FWSnyder, AHDavis, MDRouse, MOkusa, MDLynch, KRMacdonald, TL Synthesis and biological evaluation of gamma-aminophosphonates as potent, subtype-selective sphingosine 1-phosphate receptor agonists and antagonists. Bioorg Med Chem 15:663-77 (2006)  
Target
Name:
Sphingosine 1-phosphate receptor 1
Synonyms:
CHEDG1 Endothelial differentiation G-protein coupled receptor 1 S1P1 S1PR1_HUMAN Sphingosine 1-phosphate receptor Edg-1
Type:
Enzyme
Mol. Mass.:
42836.02
Organism:
Homo sapiens (Human)
Description:
P21453
Residue:
382
  
Inhibitor
Name:
BDBM50198830
Synonyms:
(R)-3-amino-4-(4-decylphenylamino)-4-oxobutylphosphonic acid | CHEMBL228139
Type:
Small organic molecule
Emp. Form.:
C20H35N2O4P
Mol. Mass.:
398.4767
SMILES:
CCCCCCCCCCc1ccc(NC(=O)[C@H](N)CCP(O)(O)=O)cc1
: