Target
Sphingosine 1-phosphate receptor 4
Ligand
BDBM50198838
Substrate
Meas. Tech.
ChEMBL_432838 (CHEMBL914106)
EC50
150±n/a nM
Citation
 Foss, FWSnyder, AHDavis, MDRouse, MOkusa, MDLynch, KRMacdonald, TL Synthesis and biological evaluation of gamma-aminophosphonates as potent, subtype-selective sphingosine 1-phosphate receptor agonists and antagonists. Bioorg Med Chem 15:663-77 (2006)  
Target
Name:
Sphingosine 1-phosphate receptor 4
Synonyms:
EDG6 S1P receptor 4 S1P4 S1PR4_HUMAN Sphingosine 1-phosphate receptor Edg-6 sphingosine-1-phosphate 4 S1P4
Type:
G Protein-Coupled Receptor (GPCR)
Mol. Mass.:
41647.39
Organism:
Homo sapiens (Human)
Description:
Residue:
384
  
Inhibitor
Name:
BDBM50198838
Synonyms:
CHEMBL228049 | [3-amino-4-(4-octylphenoxy)-butyl]-phosphonic acid
Type:
Small organic molecule
Emp. Form.:
C16H28NO4P
Mol. Mass.:
329.3716
SMILES:
CCCCCCc1ccc(OC[C@H](N)CCP(O)(O)=O)cc1
: