Target
Adenosine receptor A2b
Ligand
BDBM50199280
Substrate
Meas. Tech.
ChEMBL_412717 (CHEMBL910004)
Ki
207±n/a nM
Citation
 Kiesman, WFZhao, JConlon, PRDowling, JEPetter, RCLutterodt, FJin, XSmits, GFure, MJayaraj, AKim, JSullivan, GLinden, J Potent and orally bioavailable 8-bicyclo[2.2.2]octylxanthines as adenosine A1 receptor antagonists. J Med Chem 49:7119-31 (2006)  
Target
Name:
Adenosine receptor A2b
Synonyms:
AA2BR_HUMAN ADORA2B Adenosine receptors A2b | Adenosine receptors; A2a & A2b
Type:
G Protein-Coupled Receptor (GPCR)
Mol. Mass.:
36341.22
Organism:
Homo sapiens (Human)
Description:
Residue:
332
  
Inhibitor
Name:
BDBM50199280
Synonyms:
CHEMBL424908 | {[4-(2,6-dioxo-1,3-dipropyl-2,3,6,7-tetrahydro-1H-purin-8-yl)-bicyclo[2.2.2]octane-1-carbonyl]-amino}-acetic acid methyl ester
Type:
Small organic molecule
Emp. Form.:
C23H33N5O5
Mol. Mass.:
459.5386
SMILES:
CCCn1c2nc([nH]c2c(=O)n(CCC)c1=O)[C@@]12CC[C@@](CC1)(CC2)C(=O)NCC(=O)OC
: