Target
NAD-dependent protein deacetylase sirtuin-2
Ligand
BDBM2683
Substrate
Meas. Tech.
ChEMBL_422398 (CHEMBL909829)
IC50
7300±n/a nM
Citation
 Trapp, JJochum, AMeier, RSaunders, LMarshall, BKunick, CVerdin, EGoekjian, PSippl, WJung, M Adenosine mimetics as inhibitors of NAD+-dependent histone deacetylases, from kinase to sirtuin inhibition. J Med Chem 49:7307-16 (2006)  
Target
Name:
NAD-dependent protein deacetylase sirtuin-2
Synonyms:
NAD-Dependent Deacetylase Sirtuin-2 NAD-dependent deacetylase sirtuin 3 SIR2-like SIR2L SIR2_HUMAN Sirtuin 2 (SIRT2)
Type:
Hydrolase
Mol. Mass.:
43172.62
Organism:
Homo sapiens (Human)
Description:
Residue:
389
  
Inhibitor
Name:
BDBM2683
Synonyms:
2-[1-(3-dimethylaminopropyl)-indol-3-yl]-3-(indol-3-yl)maleimide BIM-1 GF 109203X | JMC526193 Compound 2
Type:
Small organic molecule
Emp. Form.:
C25H24N4O2
Mol. Mass.:
412.4837
SMILES:
CN(C)CCCn1cc(C2=C(C(=O)NC2=O)c2c[nH]c3ccccc23)c2ccccc12
: