Target
Plasmepsin I
Ligand
BDBM50146527
Substrate
Meas. Tech.
ChEMBL_422536 (CHEMBL911030)
Ki
727±n/a nM
Citation
 Dell'Agli, MParapini, SGalli, GVaiana, NTaramelli, DSparatore, ALiu, PDunn, BMBosisio, ERomeo, S High antiplasmodial activity of novel plasmepsins I and II inhibitors. J Med Chem 49:7440-9 (2006)  
Target
Name:
Plasmepsin I
Synonyms:
PFAPG PMI Plasmepsin-1 precursor
Type:
Enzyme
Mol. Mass.:
51463.30
Organism:
Plasmodium falciparum
Description:
Residue:
452
  
Inhibitor
Name:
BDBM50146527
Synonyms:
(3S,4S)-N-butyl-3-hydroxy-6-methyl-4-((2S,3S)-3-methyl-2-(2-(naphthalen-2-yloxy)acetamido)pentanamido)heptanamide CHEMBL318055 | PS-777621
Type:
Small organic molecule
Emp. Form.:
C30H45N3O5
Mol. Mass.:
527.6954
SMILES:
CCCCNC(=O)C[C@H](O)[C@H](CC(C)C)NC(=O)[C@@H](NC(=O)COc1ccc2ccccc2c1)C(C)CC
: