Target
Plasmepsin II
Ligand
BDBM50200017
Substrate
Meas. Tech.
ChEMBL_422537 (CHEMBL911031)
Ki
11±n/a nM
Citation
 Dell'Agli, MParapini, SGalli, GVaiana, NTaramelli, DSparatore, ALiu, PDunn, BMBosisio, ERomeo, S High antiplasmodial activity of novel plasmepsins I and II inhibitors. J Med Chem 49:7440-9 (2006)  
Target
Name:
Plasmepsin II
Synonyms:
Aspartic hemoglobinase II PLM2_PLAFX Plasmepsin 2 Plasmepsin-II
Type:
Enzyme
Mol. Mass.:
51482.09
Organism:
Plasmodium falciparum
Description:
P46925
Residue:
453
  
Inhibitor
Name:
BDBM50200017
Synonyms:
(3S,4S)-4-((2S,3S)-2-(4-(4-((S)-((S)-1-(6-amino-1-(4-(6-methoxyquinolin-8-ylamino)pentylamino)-1-oxohexan-2-ylamino)-1-oxopropan-2-yl)carbamoyl)phenoxy)benzamido)-3-methylpentanamido)-3-hydroxy-6-methylheptanoic acid butylamide | CHEMBL413461
Type:
Small organic molecule
Emp. Form.:
C56H81N9O9
Mol. Mass.:
1024.2972
SMILES:
CCCCNC(=O)C[C@H](O)[C@H](CC(C)C)NC(=O)[C@@H](NC(=O)c1ccc(Oc2ccc(cc2)C(=O)N[C@@H](C)C(=O)N[C@@H](CCCCN)C(=O)NCCCC(C)Nc2cc(OC)cc3cccnc23)cc1)C(C)CC
: