Target
Plasmepsin I
Ligand
BDBM50200019
Substrate
Meas. Tech.
ChEMBL_422536 (CHEMBL911030)
Ki
17±n/a nM
Citation
 Dell'Agli, MParapini, SGalli, GVaiana, NTaramelli, DSparatore, ALiu, PDunn, BMBosisio, ERomeo, S High antiplasmodial activity of novel plasmepsins I and II inhibitors. J Med Chem 49:7440-9 (2006)  
Target
Name:
Plasmepsin I
Synonyms:
PFAPG PMI Plasmepsin-1 precursor
Type:
Enzyme
Mol. Mass.:
51463.30
Organism:
Plasmodium falciparum
Description:
Residue:
452
  
Inhibitor
Name:
BDBM50200019
Synonyms:
(S)-2-(2S-(4-(4-(((2S,3S)-1-((3S,4S)-1-(butylamino)-3-hydroxy-6-methyl-1-oxoheptan-4-ylamino)-3-methyl-1-oxopentan-2-yl)-carbamoyl)phenoxy)benzamido)propanamido)-6-(tert-butoxycarbonyl)hexanoic acid propyl ester | CHEMBL411384
Type:
Small organic molecule
Emp. Form.:
C52H82N6O11
Mol. Mass.:
967.2411
SMILES:
CCCCNC(=O)C[C@H](O)[C@H](CC(C)C)NC(=O)[C@@H](NC(=O)c1ccc(Oc2ccc(cc2)C(=O)N[C@@H](CC(C)C)C(=O)N[C@@H](CCCCNC(=O)OC(C)(C)C)C(=O)OCCC)cc1)C(C)CC
: