Target
Caspase-3
Ligand
BDBM10334
Substrate
Meas. Tech.
ChEMBL_408840 (CHEMBL909955)
Ki
4±n/a nM
Citation
 Kopka, KFaust, AKeul, PWagner, SBreyholz, HJHöltke, CSchober, OSchäfers, MLevkau, B 5-pyrrolidinylsulfonyl isatins as a potential tool for the molecular imaging of caspases in apoptosis. J Med Chem 49:6704-15 (2006)  
Target
Name:
Caspase-3
Synonyms:
Apopain CASP3 CPP-32 Caspase 3 Caspase-3 subunit p17 SCA-1 Yama protein | caspase-3 preproprotein
Type:
Hydrolase; heterotetramer of two heterodimers
Mol. Mass.:
31607.55
Organism:
Homo sapiens (Human)
Description:
Residue:
277
  
Inhibitor
Name:
BDBM10334
Synonyms:
(S)-1-(4-Hydroxybenzyl)-5-(2-phenoxymethyl-pyrrolidine-1-sulfonyl)-1H-indole-2,3-dione CHEMBL200927 | Pyrrolidine Isatin Analogue 11f
Type:
Small organic molecule
Emp. Form.:
C26H24N2O6S
Mol. Mass.:
492.544
SMILES:
Oc1ccc(CN2C(=O)C(=O)c3cc(ccc23)S(=O)(=O)N2CCC[C@H]2COc2ccccc2)cc1
: