Target
Caspase-3
Ligand
BDBM50200313
Substrate
Meas. Tech.
ChEMBL_408842 (CHEMBL909966)
IC50
25.5±n/a nM
Citation
 Kopka, KFaust, AKeul, PWagner, SBreyholz, HJHöltke, CSchober, OSchäfers, MLevkau, B 5-pyrrolidinylsulfonyl isatins as a potential tool for the molecular imaging of caspases in apoptosis. J Med Chem 49:6704-15 (2006)  
Target
Name:
Caspase-3
Synonyms:
Apopain CASP3 CPP-32 Caspase 3 Caspase-3 subunit p17 SCA-1 Yama protein | caspase-3 preproprotein
Type:
Hydrolase; heterotetramer of two heterodimers
Mol. Mass.:
31607.55
Organism:
Homo sapiens (Human)
Description:
Residue:
277
  
Inhibitor
Name:
BDBM50200313
Synonyms:
(S)-5-[1-(2-methoxymethylpyrrolidinyl)sulfonyl]-1-(4-(tributylstannyl)benzyl)isatin | CHEMBL217822
Type:
Small organic molecule
Emp. Form.:
C33H48N2O5SSn
Mol. Mass.:
703.52
SMILES:
CCCC[Sn](CCCC)(CCCC)c1ccc(CN2C(=O)C(=O)c3cc(ccc23)S(=O)(=O)N2CCC[C@H]2COC)cc1
: