Target
Caspase-3
Ligand
BDBM10305
Substrate
Meas. Tech.
ChEMBL_408840 (CHEMBL909955)
Ki
41.8±n/a nM
Citation
 Kopka, KFaust, AKeul, PWagner, SBreyholz, HJHöltke, CSchober, OSchäfers, MLevkau, B 5-pyrrolidinylsulfonyl isatins as a potential tool for the molecular imaging of caspases in apoptosis. J Med Chem 49:6704-15 (2006)  
Target
Name:
Caspase-3
Synonyms:
Apopain CASP3 CPP-32 Caspase 3 Caspase-3 subunit p17 SCA-1 Yama protein | caspase-3 preproprotein
Type:
Hydrolase; heterotetramer of two heterodimers
Mol. Mass.:
31607.55
Organism:
Homo sapiens (Human)
Description:
Residue:
277
  
Inhibitor
Name:
BDBM10305
Synonyms:
(S)-5-[1-(2-Methoxymethyl)pyrrolidinylsulfonyl]isatin CHEMBL60190 | Isatin Sulfonamide 16
Type:
Small organic molecule
Emp. Form.:
C14H16N2O5S
Mol. Mass.:
324.352
SMILES:
COC[C@@H]1CCCN1S(=O)(=O)c1ccc2NC(=O)C(=O)c2c1
: