Target
Caspase-3
Ligand
BDBM10318
Substrate
Meas. Tech.
ChEMBL_408842 (CHEMBL909966)
IC50
16.9±n/a nM
Citation
 Kopka, KFaust, AKeul, PWagner, SBreyholz, HJHöltke, CSchober, OSchäfers, MLevkau, B 5-pyrrolidinylsulfonyl isatins as a potential tool for the molecular imaging of caspases in apoptosis. J Med Chem 49:6704-15 (2006)  
Target
Name:
Caspase-3
Synonyms:
Apopain CASP3 CPP-32 Caspase 3 Caspase-3 subunit p17 SCA-1 Yama protein | caspase-3 preproprotein
Type:
Hydrolase; heterotetramer of two heterodimers
Mol. Mass.:
31607.55
Organism:
Homo sapiens (Human)
Description:
Residue:
277
  
Inhibitor
Name:
BDBM10318
Synonyms:
(S)-5-{1-[2-(Phenoxymethyl)pyrrolidinyl]sulfonyl}isatin CHEMBL62993 Pyrrolidine Isatin Analogue 10
Type:
Small organic molecule
Emp. Form.:
C19H18N2O5S
Mol. Mass.:
386.422
SMILES:
O=C1Nc2ccc(cc2C1=O)S(=O)(=O)N1CCC[C@H]1COc1ccccc1
: