Target
Caspase-3
Ligand
BDBM50200309
Substrate
Meas. Tech.
ChEMBL_408842 (CHEMBL909966)
IC50
36.4±n/a nM
Citation
 Kopka, KFaust, AKeul, PWagner, SBreyholz, HJHöltke, CSchober, OSchäfers, MLevkau, B 5-pyrrolidinylsulfonyl isatins as a potential tool for the molecular imaging of caspases in apoptosis. J Med Chem 49:6704-15 (2006)  
Target
Name:
Caspase-3
Synonyms:
Apopain CASP3 CPP-32 Caspase 3 Caspase-3 subunit p17 SCA-1 Yama protein | caspase-3 preproprotein
Type:
Hydrolase; heterotetramer of two heterodimers
Mol. Mass.:
31607.55
Organism:
Homo sapiens (Human)
Description:
Residue:
277
  
Inhibitor
Name:
BDBM50200309
Synonyms:
(S)-1-(4-(2-fluoroethoxy)benzyl)-5-[1-(2-methoxymethylpyrrolidinyl)sulfonyl]isatin | CHEMBL215480
Type:
Small organic molecule
Emp. Form.:
C23H25FN2O6S
Mol. Mass.:
476.518
SMILES:
COC[C@@H]1CCCN1S(=O)(=O)c1ccc2N(Cc3ccc(OCCF)cc3)C(=O)C(=O)c2c1
: