Target
Caspase-7
Ligand
BDBM50200303
Substrate
Meas. Tech.
ChEMBL_408844 (CHEMBL909399)
IC50
4±n/a nM
Citation
 Kopka, KFaust, AKeul, PWagner, SBreyholz, HJHöltke, CSchober, OSchäfers, MLevkau, B 5-pyrrolidinylsulfonyl isatins as a potential tool for the molecular imaging of caspases in apoptosis. J Med Chem 49:6704-15 (2006)  
Target
Name:
Caspase-7
Synonyms:
Apoptotic protease Mch-3 CASP7 CMH-1 MCH3 | caspase 7, apoptosis-related cysteine peptidase
Type:
Enzyme
Mol. Mass.:
34273.91
Organism:
Homo sapiens (Human)
Description:
P55210
Residue:
303
  
Inhibitor
Name:
BDBM50200303
Synonyms:
(S)-1-(4-methoxybenzyl)-5-[1-(2-methoxymethylpyrrolidinyl)-sulfonyl]isatin | CHEMBL217777
Type:
Small organic molecule
Emp. Form.:
C22H24N2O6S
Mol. Mass.:
444.501
SMILES:
COC[C@@H]1CCCN1S(=O)(=O)c1ccc2N(Cc3ccc(OC)cc3)C(=O)C(=O)c2c1
: