Target
Caspase-7
Ligand
BDBM50200305
Substrate
Meas. Tech.
ChEMBL_408844 (CHEMBL909399)
IC50
18.6±n/a nM
Citation
 Kopka, KFaust, AKeul, PWagner, SBreyholz, HJHöltke, CSchober, OSchäfers, MLevkau, B 5-pyrrolidinylsulfonyl isatins as a potential tool for the molecular imaging of caspases in apoptosis. J Med Chem 49:6704-15 (2006)  
Target
Name:
Caspase-7
Synonyms:
Apoptotic protease Mch-3 CASP7 CMH-1 MCH3 | caspase 7, apoptosis-related cysteine peptidase
Type:
Enzyme
Mol. Mass.:
34273.91
Organism:
Homo sapiens (Human)
Description:
P55210
Residue:
303
  
Inhibitor
Name:
BDBM50200305
Synonyms:
(S)-1-(4-iodobenzyl)-5-(2-phenoxymethyl-pyrrolidine-1-sulfonyl)isatin CHEMBL384023
Type:
Small organic molecule
Emp. Form.:
C26H23IN2O5S
Mol. Mass.:
602.441
SMILES:
Ic1ccc(CN2C(=O)C(=O)c3cc(ccc23)S(=O)(=O)N2CCC[C@H]2COc2ccccc2)cc1
: