Target
Caspase-3
Ligand
BDBM50200306
Substrate
Meas. Tech.
ChEMBL_408842 (CHEMBL909966)
IC50
12±n/a nM
Citation
 Kopka, KFaust, AKeul, PWagner, SBreyholz, HJHöltke, CSchober, OSchäfers, MLevkau, B 5-pyrrolidinylsulfonyl isatins as a potential tool for the molecular imaging of caspases in apoptosis. J Med Chem 49:6704-15 (2006)  
Target
Name:
Caspase-3
Synonyms:
Apopain CASP3 CPP-32 Caspase 3 Caspase-3 subunit p17 SCA-1 Yama protein | caspase-3 preproprotein
Type:
Hydrolase; heterotetramer of two heterodimers
Mol. Mass.:
31607.55
Organism:
Homo sapiens (Human)
Description:
Residue:
277
  
Inhibitor
Name:
BDBM50200306
Synonyms:
(S)-1-(4-iodobenzyl)-5-[1-(2-methoxymethylpyrrolidinyl)sulfonyl]isatin | CHEMBL217457
Type:
Small organic molecule
Emp. Form.:
C21H21IN2O5S
Mol. Mass.:
540.371
SMILES:
COC[C@@H]1CCCN1S(=O)(=O)c1ccc2N(Cc3ccc(I)cc3)C(=O)C(=O)c2c1
: