Target
Caspase-7
Ligand
BDBM50200304
Substrate
Meas. Tech.
ChEMBL_408844 (CHEMBL909399)
IC50
42.8±n/a nM
Citation
 Kopka, KFaust, AKeul, PWagner, SBreyholz, HJHöltke, CSchober, OSchäfers, MLevkau, B 5-pyrrolidinylsulfonyl isatins as a potential tool for the molecular imaging of caspases in apoptosis. J Med Chem 49:6704-15 (2006)  
Target
Name:
Caspase-7
Synonyms:
Apoptotic protease Mch-3 CASP7 CMH-1 MCH3 | caspase 7, apoptosis-related cysteine peptidase
Type:
Enzyme
Mol. Mass.:
34273.91
Organism:
Homo sapiens (Human)
Description:
P55210
Residue:
303
  
Inhibitor
Name:
BDBM50200304
Synonyms:
(S)-5-[1-(2-phenoxymethylpyrrolidinyl)sulfonyl]-1-(4-(tributylstannyl)benzyl)isatin | CHEMBL386464
Type:
Small organic molecule
Emp. Form.:
C38H50N2O5SSn
Mol. Mass.:
765.59
SMILES:
CCCC[Sn](CCCC)(CCCC)c1ccc(CN2C(=O)C(=O)c3cc(ccc23)S(=O)(=O)N2CCC[C@H]2COc2ccccc2)cc1
: