Target
Histamine H3 receptor
Ligand
BDBM50200644
Substrate
Meas. Tech.
ChEMBL_453775 (CHEMBL885776)
Ki
6.42±n/a nM
Citation
 Black, LANersesian, DLSharma, PKu, YYBennani, YLMarsh, KCMiller, TREsbenshade, TAHancock, AACowart, M 4-[6-(2-Aminoethyl)naphthalen-2-yl]benzonitriles are potent histamine H3 receptor antagonists with high CNS penetration. Bioorg Med Chem Lett 17:1443-6 (2007)  
Target
Name:
Histamine H3 receptor
Synonyms:
HH3R Hrh3
Type:
G Protein-Coupled Receptor (GPCR)
Mol. Mass.:
48607.98
Organism:
Rattus norvegicus (rat)
Description:
Residue:
445
  
Inhibitor
Name:
BDBM50200644
Synonyms:
4-(6-(2-(pyrrolidin-1-yl)ethyl)naphthalen-2-yl)benzonitrile | CHEMBL247702
Type:
Small organic molecule
Emp. Form.:
C23H22N2
Mol. Mass.:
326.4342
SMILES:
N#Cc1ccc(cc1)-c1ccc2cc(CCN3CCCC3)ccc2c1
: