Target
Deoxynucleoside kinase
Ligand
BDBM50200998
Substrate
Meas. Tech.
ChEMBL_422918 (CHEMBL908770)
IC50
5700±n/a nM
Citation
 Hernandez, AIFamiliar, ONegri, ARodríguez-Barrios, FGago, FKarlsson, ACamarasa, MJBalzarini, JPérez-Pérez, MJ N1-substituted thymine derivatives as mitochondrial thymidine kinase (TK-2) inhibitors. J Med Chem 49:7766-73 (2006)  
Target
Name:
Deoxynucleoside kinase
Synonyms:
DNK_DROME Dm-dNK dnk
Type:
PROTEIN
Mol. Mass.:
29092.93
Organism:
Drosophila melanogaster
Description:
ChEMBL_627484
Residue:
250
  
Inhibitor
Name:
BDBM50200998
Synonyms:
1-[(Z)-4-[1-(4-chlorophenyl)-1,1-(diphenyl)methoxy]-2-buten-1-yl]thymine | CHEMBL373997
Type:
Small organic molecule
Emp. Form.:
C28H25ClN2O3
Mol. Mass.:
472.963
SMILES:
Cc1cn(C\C=C/COC(c2ccccc2)(c2ccccc2)c2ccc(Cl)cc2)c(=O)[nH]c1=O
: