Target
Deoxynucleoside kinase
Ligand
BDBM50201005
Substrate
Meas. Tech.
ChEMBL_422918 (CHEMBL908770)
IC50
29000±n/a nM
Citation
 Hernandez, AIFamiliar, ONegri, ARodríguez-Barrios, FGago, FKarlsson, ACamarasa, MJBalzarini, JPérez-Pérez, MJ N1-substituted thymine derivatives as mitochondrial thymidine kinase (TK-2) inhibitors. J Med Chem 49:7766-73 (2006)  
Target
Name:
Deoxynucleoside kinase
Synonyms:
DNK_DROME Dm-dNK dnk
Type:
PROTEIN
Mol. Mass.:
29092.93
Organism:
Drosophila melanogaster
Description:
ChEMBL_627484
Residue:
250
  
Inhibitor
Name:
BDBM50201005
Synonyms:
CHEMBL438603 | N-methyl-4-[1,1-(diphenyl)-1-[6-(thymin-1-yl)hexyloxy]methyl]pyridinium iodide
Type:
Small organic molecule
Emp. Form.:
C30H34N3O3
Mol. Mass.:
484.6087
SMILES:
Cc1cn(CCCCCCOC(c2ccccc2)(c2ccccc2)c2cc[n+](C)cc2)c(=O)[nH]c1=O
: