Target
D(3) dopamine receptor
Ligand
BDBM50201335
Substrate
Meas. Tech.
ChEMBL_453886 (CHEMBL885888)
Ki
475±n/a nM
Citation
 Enzensperger, CKilian, SAckermann, MKoch, AKelch, KLehmann, J Dopamine/serotonin receptor ligands. Part 15: Oxygenation of the benz-indolo-azecine LE 300 leads to novel subnanomolar dopamine D1/D5 antagonists. Bioorg Med Chem Lett 17:1399-402 (2007)  
Target
Name:
D(3) dopamine receptor
Synonyms:
DOPAMINE D3 DRD3_HUMAN Dopamine D3 receptor (D3) Dopamine receptor Dopamine receptor D3
Type:
Mol. Mass.:
44243.43
Organism:
Homo sapiens (Human)
Description:
Residue:
400
  
Inhibitor
Name:
BDBM50201335
Synonyms:
11-methoxy-7-methyl-6,7,8,9,14,15-hexahydro-5H-indolo[3,2-f][3]benzazecine | CHEMBL396560
Type:
Small organic molecule
Emp. Form.:
C21H24N2O
Mol. Mass.:
320.4281
SMILES:
COc1ccc2[nH]c3Cc4ccccc4CCN(C)CCc3c2c1
: