Target
D(2) dopamine receptor
Ligand
BDBM50201335
Substrate
Meas. Tech.
ChEMBL_453885 (CHEMBL885887)
Ki
11.9±n/a nM
Citation
 Enzensperger, CKilian, SAckermann, MKoch, AKelch, KLehmann, J Dopamine/serotonin receptor ligands. Part 15: Oxygenation of the benz-indolo-azecine LE 300 leads to novel subnanomolar dopamine D1/D5 antagonists. Bioorg Med Chem Lett 17:1399-402 (2007)  
Target
Name:
D(2) dopamine receptor
Synonyms:
D(2) dopamine receptor DOPAMINE D2 Long DRD2 Dopamine D2 receptor Dopamine D2 receptor (D2R) Dopamine2-like | d2
Type:
Cell-surface receptors
Mol. Mass.:
50647.10
Organism:
Homo sapiens (Human)
Description:
P14416
Residue:
443
  
Inhibitor
Name:
BDBM50201335
Synonyms:
11-methoxy-7-methyl-6,7,8,9,14,15-hexahydro-5H-indolo[3,2-f][3]benzazecine | CHEMBL396560
Type:
Small organic molecule
Emp. Form.:
C21H24N2O
Mol. Mass.:
320.4281
SMILES:
COc1ccc2[nH]c3Cc4ccccc4CCN(C)CCc3c2c1
: