Target
Sodium/hydrogen exchanger 1
Ligand
BDBM50058759
Substrate
Meas. Tech.
ChEMBL_446748 (CHEMBL895927)
IC50
1200±n/a nM
Citation
 Lee, SKim, TLee, BHYoo, SELee, KYi, KY 3-Substituted-(5-arylfuran-2-ylcarbonyl)guanidines as NHE-1 inhibitors. Bioorg Med Chem Lett 17:1291-5 (2007)  
Target
Name:
Sodium/hydrogen exchanger 1
Synonyms:
APNH NHE-1 Na(+)/H(+) antiporter, amiloride-sensitive SL9A1_HUMAN Solute carrier family 9 member 1
Type:
PROTEIN
Mol. Mass.:
90771.96
Organism:
Homo sapiens (Human)
Description:
ChEMBL_862405
Residue:
815
  
Inhibitor
Name:
BDBM50058759
Synonyms:
CHEMBL436559 Cariporide N-(4-Isopropyl-3-methanesulfonyl-benzoyl)-guanidine(Cariporide) N-(diaminomethylene)-4-isopropyl-3-(methylsulfonyl)benzamide
Type:
Small organic molecule
Emp. Form.:
C12H17N3O3S
Mol. Mass.:
283.347
SMILES:
CC(C)c1ccc(cc1S(C)(=O)=O)C(=O)NC(N)=N
: