Target
Metabotropic glutamate receptor 3
Ligand
BDBM50074750
Substrate
Meas. Tech.
ChEMBL_423514 (CHEMBL910532)
Ki
4.7±n/a nM
Citation
 Monn, JAMassey, SMValli, MJHenry, SSStephenson, GABures, MHérin, MCatlow, JGiera, DWright, RAJohnson, BGAndis, SLKingston, ASchoepp, DD Synthesis and metabotropic glutamate receptor activity of S-oxidized variants of (-)-4-amino-2-thiabicyclo-[3.1.0]hexane-4,6-dicarboxylate: identification of potent, selective, and orally bioavailable agonists for mGlu2/3 receptors. J Med Chem 50:233-40 (2007)  
Target
Name:
Metabotropic glutamate receptor 3
Synonyms:
GPRC1C GRM3_HUMAN metabotropic glutamate 3 metabotropic glutamate 3/1c
Type:
Enzyme Catalytic Domain
Mol. Mass.:
98889.09
Organism:
Homo sapiens (Human)
Description:
metabotropic glutamate 1c 0 HUMAN::Q14832
Residue:
879
  
Inhibitor
Name:
BDBM50074750
Synonyms:
(1R,4S,5S,6S)-4-amino-2-thia-bicyclo[3.1.0]hexane-4,6-dicarboxylic acid CHEMBL8839 | LY-389795
Type:
Small organic molecule
Emp. Form.:
C7H9NO4S
Mol. Mass.:
203.216
SMILES:
N[C@]1(CS[C@H]2[C@@H]([C@@H]12)C(O)=O)C(O)=O
: