Target
RAC-alpha serine/threonine-protein kinase
Ligand
BDBM50204329
Substrate
Meas. Tech.
ChEMBL_454401 (CHEMBL903578)
IC50
58000±n/a nM
Citation
 Kayser, KJGlenn, MPSebti, SMCheng, JQHamilton, AD Modifications of the GSK3beta substrate sequence to produce substrate-mimetic inhibitors of Akt as potential anti-cancer therapeutics. Bioorg Med Chem Lett 17:2068-73 (2007)  
Target
Name:
RAC-alpha serine/threonine-protein kinase
Synonyms:
AKT phosphorylation (p-AKT) AKT1/PPP1CA C-AKT PKB alpha Protein kinase B Protein kinase B (Akt 1) Protein kinase B alpha Proto-oncogene Akt (Akt1) Proto-oncogene c-Akt (AKT1) RAC-PK-alpha RAC-alpha serine/threonine-protein kinase (AKT1) | RAC-alpha serine/threonine-protein kinase (pAKT)
Type:
Enzyme
Mol. Mass.:
55681.25
Organism:
Homo sapiens (Human)
Description:
P31749
Residue:
480
  
Inhibitor
Name:
BDBM50204329
Synonyms:
CHEMBL391132 | N-[(S)-1-((S)-1-benzylcarbamoyl-2-phenyl-ethylcarbamoyl)-2-methyl-propyl]-4-[(tert-butylcarbamoyl-methyl)-(5-guanidino-pentanoyl)-amino]-benzamide
Type:
Small organic molecule
Emp. Form.:
C40H54N8O5
Mol. Mass.:
726.9074
SMILES:
[#6]-[#6](-[#6])-[#6@H](-[#7]-[#6](=O)-c1ccc(cc1)-[#7](-[#6]-[#6](=O)-[#7]C([#6])([#6])[#6])-[#6](=O)-[#6]-[#6]-[#6]-[#6]\[#7]=[#6](\[#7])-[#7])-[#6](=O)-[#7]-[#6@@H](-[#6]-c1ccccc1)-[#6](=O)-[#7]-[#6]-c1ccccc1
: