Target
RAC-alpha serine/threonine-protein kinase
Ligand
BDBM50204331
Substrate
Meas. Tech.
ChEMBL_454401 (CHEMBL903578)
IC50
239000±n/a nM
Citation
 Kayser, KJGlenn, MPSebti, SMCheng, JQHamilton, AD Modifications of the GSK3beta substrate sequence to produce substrate-mimetic inhibitors of Akt as potential anti-cancer therapeutics. Bioorg Med Chem Lett 17:2068-73 (2007)  
Target
Name:
RAC-alpha serine/threonine-protein kinase
Synonyms:
AKT phosphorylation (p-AKT) AKT1/PPP1CA C-AKT PKB alpha Protein kinase B Protein kinase B (Akt 1) Protein kinase B alpha Proto-oncogene Akt (Akt1) Proto-oncogene c-Akt (AKT1) RAC-PK-alpha RAC-alpha serine/threonine-protein kinase (AKT1) | RAC-alpha serine/threonine-protein kinase (pAKT)
Type:
Enzyme
Mol. Mass.:
55681.25
Organism:
Homo sapiens (Human)
Description:
P31749
Residue:
480
  
Inhibitor
Name:
BDBM50204331
Synonyms:
(2S)-N-[(1S,2R)-1-{[(1S,2R)-1-{[(1S)-1-{[(1S)-1-(benzylcarbamoyl)-2-phenylethyl]carbamoyl}-2-methylpropyl]carbamoyl}-2-hydroxypropyl]carbamoyl}-2-hydroxypropyl]-5-carbamimidamido-2-{[(2S)-1-[(2S)-5-carbamimidamido-2-(2-acetamidoacetamido)pentanoyl]pyrrolidin-2-yl]formamido}pentanamide | CHEMBL245933
Type:
Small organic molecule
Emp. Form.:
C50H77N15O11
Mol. Mass.:
1064.2403
SMILES:
[#6]-[#6](-[#6])-[#6@H](-[#7]-[#6](=O)-[#6@@H](-[#7]-[#6](=O)-[#6@@H](-[#7]-[#6](=O)-[#6@H](-[#6]-[#6]-[#6]\[#7]=[#6](\[#7])-[#7])-[#7]-[#6](=O)-[#6@@H]-1-[#6]-[#6]-[#6]-[#7]-1-[#6](=O)-[#6@H](-[#6]-[#6]-[#6]\[#7]=[#6](\[#7])-[#7])-[#7]-[#6](=O)-[#6]-[#7]-[#6](-[#6])=O)-[#6@@H](-[#6])-[#8])-[#6@@H](-[#6])-[#8])-[#6](=O)-[#7]-[#6@@H](-[#6]-c1ccccc1)-[#6](=O)-[#7]-[#6]-c1ccccc1
: