Target
RAC-alpha serine/threonine-protein kinase
Ligand
BDBM50204334
Substrate
Meas. Tech.
ChEMBL_454401 (CHEMBL903578)
IC50
>500000±n/a nM
Citation
 Kayser, KJGlenn, MPSebti, SMCheng, JQHamilton, AD Modifications of the GSK3beta substrate sequence to produce substrate-mimetic inhibitors of Akt as potential anti-cancer therapeutics. Bioorg Med Chem Lett 17:2068-73 (2007)  
Target
Name:
RAC-alpha serine/threonine-protein kinase
Synonyms:
AKT phosphorylation (p-AKT) AKT1/PPP1CA C-AKT PKB alpha Protein kinase B Protein kinase B (Akt 1) Protein kinase B alpha Proto-oncogene Akt (Akt1) Proto-oncogene c-Akt (AKT1) RAC-PK-alpha RAC-alpha serine/threonine-protein kinase (AKT1) | RAC-alpha serine/threonine-protein kinase (pAKT)
Type:
Enzyme
Mol. Mass.:
55681.25
Organism:
Homo sapiens (Human)
Description:
P31749
Residue:
480
  
Inhibitor
Name:
BDBM50204334
Synonyms:
(2S)-2-[(2S)-2-[(2S,3R)-2-[(2S,3R)-2-[(2S)-5-carbamimidamido-2-{[(2S)-1-[(2S)-5-carbamimidamido-2-(2-acetamidoacetamido)pentanoyl]pyrrolidin-2-yl]formamido}pentanamido]-3-hydroxybutanamido]-3-hydroxybutanamido]-3-(1H-indol-3-yl)propanamido]-3-phenylpropanoic acid | CHEMBL437750
Type:
Small organic molecule
Emp. Form.:
C49H71N15O12
Mol. Mass.:
1062.1813
SMILES:
C[C@@H](O)[C@H](NC(=O)[C@H](CCCN=C(N)N)NC(=O)[C@@H]1CCCN1C(=O)[C@H](CCCN=C(N)N)NC(=O)CNC(C)=O)C(=O)N[C@@H]([C@@H](C)O)C(=O)N[C@@H](Cc1c[nH]c2ccccc12)C(=O)N[C@@H](Cc1ccccc1)C(O)=O
: