Target
RAC-alpha serine/threonine-protein kinase
Ligand
BDBM50204333
Substrate
Meas. Tech.
ChEMBL_454401 (CHEMBL903578)
IC50
193000±n/a nM
Citation
 Kayser, KJGlenn, MPSebti, SMCheng, JQHamilton, AD Modifications of the GSK3beta substrate sequence to produce substrate-mimetic inhibitors of Akt as potential anti-cancer therapeutics. Bioorg Med Chem Lett 17:2068-73 (2007)  
Target
Name:
RAC-alpha serine/threonine-protein kinase
Synonyms:
AKT phosphorylation (p-AKT) AKT1/PPP1CA C-AKT PKB alpha Protein kinase B Protein kinase B (Akt 1) Protein kinase B alpha Proto-oncogene Akt (Akt1) Proto-oncogene c-Akt (AKT1) RAC-PK-alpha RAC-alpha serine/threonine-protein kinase (AKT1) | RAC-alpha serine/threonine-protein kinase (pAKT)
Type:
Enzyme
Mol. Mass.:
55681.25
Organism:
Homo sapiens (Human)
Description:
P31749
Residue:
480
  
Inhibitor
Name:
BDBM50204333
Synonyms:
CHEMBL396530 | N-(4-{[(1S)-1-{[(1S)-1-(benzylcarbamoyl)-2-phenylethyl]carbamoyl}-2-methylpropyl]carbamoyl}phenyl)-5-carbamimidamidopentanamide
Type:
Small organic molecule
Emp. Form.:
C34H43N7O4
Mol. Mass.:
613.7497
SMILES:
CC(C)[C@H](NC(=O)c1ccc(NC(=O)CCCCNC(N)=N)cc1)C(=O)N[C@@H](Cc1ccccc1)C(=O)NCc1ccccc1
: