Target
RAC-alpha serine/threonine-protein kinase
Ligand
BDBM50204338
Substrate
Meas. Tech.
ChEMBL_454401 (CHEMBL903578)
IC50
14000±n/a nM
Citation
 Kayser, KJGlenn, MPSebti, SMCheng, JQHamilton, AD Modifications of the GSK3beta substrate sequence to produce substrate-mimetic inhibitors of Akt as potential anti-cancer therapeutics. Bioorg Med Chem Lett 17:2068-73 (2007)  
Target
Name:
RAC-alpha serine/threonine-protein kinase
Synonyms:
AKT phosphorylation (p-AKT) AKT1/PPP1CA C-AKT PKB alpha Protein kinase B Protein kinase B (Akt 1) Protein kinase B alpha Proto-oncogene Akt (Akt1) Proto-oncogene c-Akt (AKT1) RAC-PK-alpha RAC-alpha serine/threonine-protein kinase (AKT1) | RAC-alpha serine/threonine-protein kinase (pAKT)
Type:
Enzyme
Mol. Mass.:
55681.25
Organism:
Homo sapiens (Human)
Description:
P31749
Residue:
480
  
Inhibitor
Name:
BDBM50204338
Synonyms:
CHEMBL395685 | N-((S)-1-((S)-1-(benzylamino)-1-oxo-3-phenylpropan-2-ylamino)-3-methyl-1-oxobutan-2-yl)-4-(N-(2-(benzylamino)-2-oxoethyl)-5-guanidinopentanamido)benzamide
Type:
Small organic molecule
Emp. Form.:
C43H52N8O5
Mol. Mass.:
760.9236
SMILES:
[#6]-[#6](-[#6])-[#6@H](-[#7]-[#6](=O)-c1ccc(cc1)-[#7](-[#6]-[#6](=O)-[#7]-[#6]-c1ccccc1)-[#6](=O)-[#6]-[#6]-[#6]-[#6]\[#7]=[#6](\[#7])-[#7])-[#6](=O)-[#7]-[#6@@H](-[#6]-c1ccccc1)-[#6](=O)-[#7]-[#6]-c1ccccc1
: