Target
RAC-alpha serine/threonine-protein kinase
Ligand
BDBM50204358
Substrate
Meas. Tech.
ChEMBL_454401 (CHEMBL903578)
IC50
>500000±n/a nM
Citation
 Kayser, KJGlenn, MPSebti, SMCheng, JQHamilton, AD Modifications of the GSK3beta substrate sequence to produce substrate-mimetic inhibitors of Akt as potential anti-cancer therapeutics. Bioorg Med Chem Lett 17:2068-73 (2007)  
Target
Name:
RAC-alpha serine/threonine-protein kinase
Synonyms:
AKT phosphorylation (p-AKT) AKT1/PPP1CA C-AKT PKB alpha Protein kinase B Protein kinase B (Akt 1) Protein kinase B alpha Proto-oncogene Akt (Akt1) Proto-oncogene c-Akt (AKT1) RAC-PK-alpha RAC-alpha serine/threonine-protein kinase (AKT1) | RAC-alpha serine/threonine-protein kinase (pAKT)
Type:
Enzyme
Mol. Mass.:
55681.25
Organism:
Homo sapiens (Human)
Description:
P31749
Residue:
480
  
Inhibitor
Name:
BDBM50204358
Synonyms:
(2S)-N-[(1S)-1-(benzylcarbamoyl)-2-phenylethyl]-2-({4-[(2S)-2-{[(2S)-1-[(2S)-2-(2-acetamidoacetamido)propanoyl]pyrrolidin-2-yl]formamido}propanamido]phenyl}formamido)-3-methylbutanamide | CHEMBL394041
Type:
Small organic molecule
Emp. Form.:
C43H54N8O8
Mol. Mass.:
810.9377
SMILES:
CC(C)[C@H](NC(=O)c1ccc(NC(=O)[C@H](C)NC(=O)[C@@H]2CCCN2C(=O)[C@H](C)NC(=O)CNC(C)=O)cc1)C(=O)N[C@@H](Cc1ccccc1)C(=O)NCc1ccccc1
: