Target
Tyrosine-protein kinase Lck
Ligand
BDBM50204585
Substrate
Meas. Tech.
ChEMBL_454458 (CHEMBL902547)
IC50
11±n/a nM
Citation
 DiMauro, EFNewcomb, JNunes, JJBemis, JEBoucher, CBuchanan, JLBuckner, WHCheng, AFaust, THsieh, FHuang, XLee, JHMarshall, TLMartin, MWMcGowan, DCSchneider, STurci, SMWhite, RDZhu, X Discovery of 4-amino-5,6-biaryl-furo[2,3-d]pyrimidines as inhibitors of Lck: development of an expedient and divergent synthetic route and preliminary SAR. Bioorg Med Chem Lett 17:2305-9 (2007)  
Target
Name:
Tyrosine-protein kinase Lck
Synonyms:
2.7.10.2 LCK_HUMAN Leukocyte C-terminal Src kinase Lymphocyte-specific protein tyrosine kinase Protein YT16 Proto-oncogene tyrosine-protein kinase LCK T cell-specific protein-tyrosine kinase
Type:
Mol. Mass.:
57987.83
Organism:
Homo sapiens (Human)
Description:
P06239
Residue:
509
  
Inhibitor
Name:
BDBM50204585
Synonyms:
(S)-5-phenyl-6-(4-(2-(pyrrolidin-1-yl)ethoxy)phenyl)-N-((tetrahydrofuran-2-yl)methyl)furo[2,3-d]pyrimidin-4-amine | CHEMBL247480
Type:
Small organic molecule
Emp. Form.:
C29H32N4O3
Mol. Mass.:
484.5894
SMILES:
C(CN1CCCC1)Oc1ccc(cc1)-c1oc2ncnc(NC[C@@H]3CCCO3)c2c1-c1ccccc1
: