Target
Adenosine receptor A2a
Ligand
BDBM50205290
Substrate
Meas. Tech.
ChEMBL_425909 (CHEMBL907969)
Ki
114±n/a nM
Citation
 Chang, LCvon Frijtag Drabbe Künzel, JKMulder-Krieger, TWesterhout, JSpangenberg, TBrussee, JIjzerman, AP 2,6,8-trisubstituted 1-deazapurines as adenosine receptor antagonists. J Med Chem 50:828-34 (2007)  
Target
Name:
Adenosine receptor A2a
Synonyms:
A2A adenosine receptor (hA2A) ADENOSINE A2 ADORA2 Adenosine A2A receptor (A2AAR)
Type:
G Protein-Coupled Receptor (GPCR)
Mol. Mass.:
44716.46
Organism:
Homo sapiens (Human)
Description:
P29274
Residue:
412
  
Inhibitor
Name:
BDBM50205290
Synonyms:
2,6-dphenyl-8-propyl-1-deazapurine | CHEMBL376648
Type:
Small organic molecule
Emp. Form.:
C21H19N3
Mol. Mass.:
313.3957
SMILES:
CCCc1nc2c(cc(nc2[nH]1)-c1ccccc1)-c1ccccc1
: